{"text_format":"3","workbook":"xlsx","n_sheets":4,"sheets":["1.사업팀제공","2.사업팀제공","3.소득기준금액계산","4.건보료자료"],"not_rendered":{"defined_names":4,"comments":1},"read":"whole","date_system":"1900"}

{"sheet":"1.사업팀제공","index":0,"n_rows":748,"n_cols":7,"rows_kept":748,"merged":[[3,0,3,4],[5,0,6,0],[5,1,6,1],[5,2,5,4],[5,6,6,6],[7,0,8,0],[7,1,8,1],[9,0,10,0],[9,1,10,1],[11,0,12,0],[11,1,12,1],[13,0,14,0],[13,1,14,1],[15,0,16,0],[15,1,16,1],[17,0,18,0],[17,1,18,1],[19,0,20,0],[19,1,20,1],[21,0,22,0],[21,1,22,1],[23,0,24,0],[23,1,24,1],[25,0,26,0],[25,1,26,1],[31,0,31,4],[33,0,34,0],[33,1,34,1],[33,2,33,4],[33,6,34,6],[35,0,36,0],[35,1,36,1],[37,0,38,0],[37,1,38,1],[39,0,40,0],[39,1,40,1],[41,0,42,0],[41,1,42,1],[43,0,44,0],[43,1,44,1],[45,0,46,0],[45,1,46,1],[47,0,48,0],[47,1,48,1],[49,0,50,0],[49,1,50,1],[51,0,52,0],[51,1,52,1],[53,0,54,0],[53,1,54,1],[59,0,59,4],[61,0,62,0],[61,1,62,1],[61,2,61,4],[61,6,62,6],[63,0,64,0],[63,1,64,1],[65,0,66,0],[65,1,66,1],[67,0,68,0],[67,1,68,1],[69,0,70,0],[69,1,70,1],[71,0,72,0],[71,1,72,1],[73,0,74,0],[73,1,74,1],[75,0,76,0],[75,1,76,1],[77,0,78,0],[77,1,78,1],[79,0,80,0],[79,1,80,1],[81,0,82,0],[81,1,82,1],[87,0,87,4],[89,0,90,0],[89,1,90,1],[89,2,89,4],[89,6,90,6],[91,0,92,0],[91,1,92,1],[93,0,94,0],[93,1,94,1],[95,0,96,0],[95,1,96,1],[97,0,98,0],[97,1,98,1],[99,0,100,0],[99,1,100,1],[101,0,102,0],[101,1,102,1],[103,0,104,0],[103,1,104,1],[105,0,106,0],[105,1,106,1],[107,0,108,0],[107,1,108,1],[109,0,110,0],[109,1,110,1],[115,0,115,4],[117,0,118,0],[117,1,118,1],[117,2,117,4],[117,6,118,6],[119,0,120,0],[119,1,120,1],[121,0,122,0],[121,1,122,1],[123,0,124,0],[123,1,124,1],[125,0,126,0],[125,1,126,1],[127,0,128,0],[127,1,128,1],[129,0,130,0],[129,1,130,1],[131,0,132,0],[131,1,132,1],[133,0,134,0],[133,1,134,1],[135,0,136,0],[135,1,136,1],[137,0,138,0],[137,1,138,1],[143,0,143,4],[145,0,146,0],[145,1,146,1],[145,2,145,4],[145,6,146,6],[147,0,148,0],[147,1,148,1],[149,0,150,0],[149,1,150,1],[151,0,152,0],[151,1,152,1],[153,0,154,0],[153,1,154,1],[155,0,156,0],[155,1,156,1],[157,0,158,0],[157,1,158,1],[159,0,160,0],[159,1,160,1],[161,0,162,0],[161,1,162,1],[163,0,164,0],[163,1,164,1],[165,0,166,0],[165,1,166,1],[171,0,171,4],[173,0,174,0],[173,1,174,1],[173,2,173,4],[173,6,174,6],[175,0,176,0],[175,1,176,1],[177,0,178,0],[177,1,178,1],[179,0,180,0],[179,1,180,1],[181,0,182,0],[181,1,182,1],[183,0,184,0],[183,1,184,1],[185,0,186,0],[185,1,186,1],[187,0,188,0],[187,1,188,1],[189,0,190,0],[189,1,190,1],[191,0,192,0],[191,1,192,1],[193,0,194,0],[193,1,194,1],[199,0,199,4],[201,0,202,0],[201,1,202,1],[201,2,201,4],[201,6,202,6],[203,0,204,0],[203,1,204,1],[205,0,206,0],[205,1,206,1],[207,0,208,0],[207,1,208,1],[209,0,210,0],[209,1,210,1],[211,0,212,0],[211,1,212,1],[213,0,214,0],[213,1,214,1],[215,0,216,0],[215,1,216,1],[217,0,218,0],[217,1,218,1],[219,0,220,0],[219,1,220,1],[221,0,222,0],[221,1,222,1],[227,0,227,4],[229,0,230,0],[229,1,230,1],[229,2,229,4],[229,6,230,6],[231,0,232,0],[231,1,232,1],[233,0,234,0],[233,1,234,1],[235,0,236,0],[235,1,236,1],[237,0,238,0],[237,1,238,1],[239,0,240,0],[239,1,240,1],[241,0,242,0],[241,1,242,1],[243,0,244,0],[243,1,244,1],[245,0,246,0],[245,1,246,1],[247,0,248,0],[247,1,248,1],[249,0,250,0],[249,1,250,1],[255,0,255,4],[257,0,258,0],[257,1,258,1],[257,2,257,4],[257,6,258,6],[259,0,260,0],[259,1,260,1],[261,0,262,0],[261,1,262,1],[263,0,264,0],[263,1,264,1],[265,0,266,0],[265,1,266,1],[267,0,268,0],[267,1,268,1],[269,0,270,0],[269,1,270,1],[271,0,272,0],[271,1,272,1],[273,0,274,0],[273,1,274,1],[275,0,276,0],[275,1,276,1],[277,0,278,0],[277,1,278,1],[283,0,283,4],[285,0,286,0],[285,1,286,1],[285,2,285,4],[285,6,286,6],[287,0,288,0],[287,1,288,1],[289,0,290,0],[289,1,290,1],[291,0,292,0],[291,1,292,1],[293,0,294,0],[293,1,294,1],[295,0,296,0],[295,1,296,1],[297,0,298,0],[297,1,298,1],[299,0,300,0],[299,1,300,1],[301,0,302,0],[301,1,302,1],[303,0,304,0],[303,1,304,1],[305,0,306,0],[305,1,306,1],[311,0,311,4],[313,0,314,0],[313,1,314,1],[313,2,313,4],[313,6,314,6],[315,0,316,0],[315,1,316,1],[317,0,318,0],[317,1,318,1],[319,0,320,0],[319,1,320,1],[321,0,322,0],[321,1,322,1],[323,0,324,0],[323,1,324,1],[325,0,326,0],[325,1,326,1],[327,0,328,0],[327,1,328,1],[329,0,330,0],[329,1,330,1],[331,0,332,0],[331,1,332,1],[333,0,334,0],[333,1,334,1],[339,0,339,4],[341,0,342,0],[341,1,342,1],[341,2,341,4],[341,6,342,6],[343,0,344,0],[343,1,344,1],[345,0,346,0],[345,1,346,1],[347,0,348,0],[347,1,348,1],[349,0,350,0],[349,1,350,1],[351,0,352,0],[351,1,352,1],[353,0,354,0],[353,1,354,1],[355,0,356,0],[355,1,356,1],[357,0,358,0],[357,1,358,1],[359,0,360,0],[359,1,360,1],[361,0,362,0],[361,1,362,1],[367,0,367,4],[369,0,370,0],[369,1,370,1],[369,2,369,4],[369,6,370,6],[371,0,372,0],[371,1,372,1],[373,0,374,0],[373,1,374,1],[375,0,376,0],[375,1,376,1],[377,0,378,0],[377,1,378,1],[379,0,380,0],[379,1,380,1],[381,0,382,0],[381,1,382,1],[383,0,384,0],[383,1,384,1],[385,0,386,0],[385,1,386,1],[387,0,388,0],[387,1,388,1],[389,0,390,0],[389,1,390,1],[395,0,395,4],[397,0,398,0],[397,1,398,1],[397,2,397,4],[397,6,398,6],[399,0,400,0],[399,1,400,1],[401,0,402,0],[401,1,402,1],[403,0,404,0],[403,1,404,1],[405,0,406,0],[405,1,406,1],[407,0,408,0],[407,1,408,1],[409,0,410,0],[409,1,410,1],[411,0,412,0],[411,1,412,1],[413,0,414,0],[413,1,414,1],[415,0,416,0],[415,1,416,1],[417,0,418,0],[417,1,418,1],[422,0,422,4],[424,0,425,0],[424,1,425,1],[424,2,424,4],[424,6,425,6],[426,0,427,0],[426,1,427,1],[428,0,429,0],[428,1,429,1],[430,0,431,0],[430,1,431,1],[432,0,433,0],[432,1,433,1],[434,0,435,0],[434,1,435,1],[436,0,437,0],[436,1,437,1],[438,0,439,0],[438,1,439,1],[440,0,441,0],[440,1,441,1],[442,0,443,0],[442,1,443,1],[444,0,445,0],[444,1,445,1],[449,0,449,4],[451,0,452,0],[451,1,452,1],[451,2,451,4],[451,6,452,6],[453,0,454,0],[453,1,454,1],[455,0,456,0],[455,1,456,1],[457,0,458,0],[457,1,458,1],[459,0,460,0],[459,1,460,1],[461,0,462,0],[461,1,462,1],[463,0,464,0],[463,1,464,1],[465,0,466,0],[465,1,466,1],[467,0,468,0],[467,1,468,1],[469,0,470,0],[469,1,470,1],[471,0,472,0],[471,1,472,1],[477,0,477,4],[479,0,480,0],[479,1,480,1],[479,2,479,4],[479,6,480,6],[481,0,482,0],[481,1,482,1],[483,0,484,0],[483,1,484,1],[485,0,486,0],[485,1,486,1],[487,0,488,0],[487,1,488,1],[489,0,490,0],[489,1,490,1],[491,0,492,0],[491,1,492,1],[493,0,494,0],[493,1,494,1],[495,0,496,0],[495,1,496,1],[497,0,498,0],[497,1,498,1],[499,0,500,0],[499,1,500,1],[504,0,504,4],[506,0,507,0],[506,1,507,1],[506,2,506,4],[506,6,507,6],[508,0,509,0],[508,1,509,1],[510,0,511,0],[510,1,511,1],[512,0,513,0],[512,1,513,1],[514,0,515,0],[514,1,515,1],[516,0,517,0],[516,1,517,1],[518,0,519,0],[518,1,519,1],[520,0,521,0],[520,1,521,1],[522,0,523,0],[522,1,523,1],[524,0,525,0],[524,1,525,1],[526,0,527,0],[526,1,527,1],[531,0,531,4],[533,0,534,0],[533,1,534,1],[533,2,533,4],[533,6,534,6],[535,0,536,0],[535,1,536,1],[537,0,538,0],[537,1,538,1],[539,0,540,0],[539,1,540,1],[541,0,542,0],[541,1,542,1],[543,0,544,0],[543,1,544,1],[545,0,546,0],[545,1,546,1],[547,0,548,0],[547,1,548,1],[549,0,550,0],[549,1,550,1],[551,0,552,0],[551,1,552,1],[553,0,554,0],[553,1,554,1],[559,0,559,4],[561,0,562,0],[561,1,562,1],[561,2,561,4],[561,6,562,6],[563,0,564,0],[563,1,564,1],[565,0,566,0],[565,1,566,1],[567,0,568,0],[567,1,568,1],[569,0,570,0],[569,1,570,1],[571,0,572,0],[571,1,572,1],[573,0,574,0],[573,1,574,1],[575,0,576,0],[575,1,576,1],[577,0,578,0],[577,1,578,1],[579,0,580,0],[579,1,580,1],[581,0,582,0],[581,1,582,1],[586,0,586,4],[588,0,589,0],[588,1,589,1],[588,2,588,4],[588,6,589,6],[590,0,591,0],[590,1,591,1],[592,0,593,0],[592,1,593,1],[594,0,595,0],[594,1,595,1],[596,0,597,0],[596,1,597,1],[598,0,599,0],[598,1,599,1],[600,0,601,0],[600,1,601,1],[602,0,603,0],[602,1,603,1],[604,0,605,0],[604,1,605,1],[606,0,607,0],[606,1,607,1],[608,0,609,0],[608,1,609,1],[613,0,613,4],[615,0,616,0],[615,1,616,1],[615,2,615,4],[615,6,616,6],[617,0,618,0],[617,1,618,1],[619,0,620,0],[619,1,620,1],[621,0,622,0],[621,1,622,1],[623,0,624,0],[623,1,624,1],[625,0,626,0],[625,1,626,1],[627,0,628,0],[627,1,628,1],[629,0,630,0],[629,1,630,1],[631,0,632,0],[631,1,632,1],[633,0,634,0],[633,1,634,1],[635,0,636,0],[635,1,636,1],[640,0,640,4],[642,0,643,0],[642,1,643,1],[642,2,642,4],[642,6,643,6],[644,0,645,0],[644,1,645,1],[646,0,647,0],[646,1,647,1],[648,0,649,0],[648,1,649,1],[650,0,651,0],[650,1,651,1],[652,0,653,0],[652,1,653,1],[654,0,655,0],[654,1,655,1],[656,0,657,0],[656,1,657,1],[658,0,659,0],[658,1,659,1],[660,0,661,0],[660,1,661,1],[662,0,663,0],[662,1,663,1],[667,0,667,4],[669,0,670,0],[669,1,670,1],[669,2,669,4],[669,6,670,6],[671,0,672,0],[671,1,672,1],[673,0,674,0],[673,1,674,1],[675,0,676,0],[675,1,676,1],[677,0,678,0],[677,1,678,1],[679,0,680,0],[679,1,680,1],[681,0,682,0],[681,1,682,1],[683,0,684,0],[683,1,684,1],[685,0,686,0],[685,1,686,1],[687,0,688,0],[687,1,688,1],[689,0,690,0],[689,1,690,1],[692,0,692,5],[697,0,697,4],[699,0,700,0],[699,1,700,1],[699,2,699,4],[699,6,700,6],[701,0,702,0],[701,1,702,1],[703,0,704,0],[703,1,704,1],[705,0,706,0],[705,1,706,1],[707,0,708,0],[707,1,708,1],[709,0,710,0],[709,1,710,1],[711,0,712,0],[711,1,712,1],[713,0,714,0],[713,1,714,1],[715,0,716,0],[715,1,716,1],[717,0,718,0],[717,1,718,1],[719,0,720,0],[719,1,720,1],[724,0,724,4],[726,0,727,0],[726,1,727,1],[726,2,726,4],[726,6,727,6],[728,0,729,0],[728,1,729,1],[730,0,731,0],[730,1,731,1],[732,0,733,0],[732,1,733,1],[734,0,735,0],[734,1,735,1],[736,0,737,0],[736,1,737,1],[738,0,739,0],[738,1,739,1],[740,0,741,0],[740,1,741,1],[742,0,743,0],[742,1,743,1],[744,0,745,0],[744,1,745,1],[746,0,747,0],[746,1,747,1]]}
[]
[]
[{"$nulls":6},"*소득액(원)은 절대 손대지 말것"]
["2014년도 기준(전국가구평균소득 40%)"]
[]
["가구원수","소득기준(가져오는 값)","건강보험료 본인부담금",{"$nulls":3},"소득액(원)"]
[null,null,"직장가입자","지역가입자","혼합"]
["1인",{"$f":"'3.소득기준금액계산'!D21","v":{"v":615000,"d":"615,000"}},{"$f":"VLOOKUP($G8,'2.사업팀제공'!$A:$D,2,FALSE)","v":{"v":19698,"d":"19,698"}},{"$f":"VLOOKUP($G8,'2.사업팀제공'!$A:$D,3,FALSE)","v":{"v":3080,"d":"3,080"}},{"$f":"VLOOKUP($G8,'2.사업팀제공'!$A:$D,4,FALSE)","v":{"v":20972,"d":"20,972"}},null,{"$f":"MIN(IF('2.사업팀제공'!$A$6:$A$205>='1.사업팀제공'!B8:B8,'2.사업팀제공'!$A$6:$A$205,\"\"))","v":{"v":657701,"d":"657,701"}}]
[null,null,{"$f":"C8*1.0655","v":{"v":20988.218999999997,"d":"20,988"}},{"$f":"D8*1.0655","v":{"v":3281.74,"d":"3,282"}},{"$f":"E8*1.0655","v":{"v":22345.665999999997,"d":"22,346"}},"노인장기요양보험료 포함"]
["2인",{"$f":"'3.소득기준금액계산'!E21","v":{"v":1165000,"d":"1,165,000"}},{"$f":"VLOOKUP($G10,'2.사업팀제공'!$A:$D,2,FALSE)","v":{"v":35197,"d":"35,197"}},{"$f":"VLOOKUP($G10,'2.사업팀제공'!$A:$D,3,FALSE)","v":{"v":15704,"d":"15,704"}},{"$f":"VLOOKUP($G10,'2.사업팀제공'!$A:$D,4,FALSE)","v":{"v":35830,"d":"35,830"}},null,{"$f":"MIN(IF('2.사업팀제공'!$A$6:$A$205>='1.사업팀제공'!B10:B10,'2.사업팀제공'!$A$6:$A$205,\"\"))","v":{"v":1175183,"d":"1,175,183"}}]
[null,null,{"$f":"C10*1.0655","v":{"v":37502.40349999999,"d":"37,502"}},{"$f":"D10*1.0655","v":{"v":16732.611999999997,"d":"16,733"}},{"$f":"E10*1.0655","v":{"v":38176.865,"d":"38,177"}}]
["3인",{"$f":"'3.소득기준금액계산'!F21","v":{"v":1713000,"d":"1,713,000"}},{"$f":"VLOOKUP($G12,'2.사업팀제공'!$A:$D,2,FALSE)","v":{"v":51352,"d":"51,352"}},{"$f":"VLOOKUP($G12,'2.사업팀제공'!$A:$D,3,FALSE)","v":{"v":36722,"d":"36,722"}},{"$f":"VLOOKUP($G12,'2.사업팀제공'!$A:$D,4,FALSE)","v":{"v":52041,"d":"52,041"}},null,{"$f":"MIN(IF('2.사업팀제공'!$A$6:$A$205>='1.사업팀제공'!B12:B12,'2.사업팀제공'!$A$6:$A$205,\"\"))","v":{"v":1714603,"d":"1,714,603"}}]
[null,null,{"$f":"C12*1.0655","v":{"v":54715.556,"d":"54,716"}},{"$f":"D12*1.0655","v":{"v":39127.291,"d":"39,127"}},{"$f":"E12*1.0655","v":{"v":55449.68549999999,"d":"55,450"}}]
["4인",{"$f":"'3.소득기준금액계산'!G21","v":{"v":1934000,"d":"1,934,000"}},{"$f":"VLOOKUP($G14,'2.사업팀제공'!$A:$D,2,FALSE)","v":{"v":58590,"d":"58,590"}},{"$f":"VLOOKUP($G14,'2.사업팀제공'!$A:$D,3,FALSE)","v":{"v":47492,"d":"47,492"}},{"$f":"VLOOKUP($G14,'2.사업팀제공'!$A:$D,4,FALSE)","v":{"v":59375,"d":"59,375"}},null,{"$f":"MIN(IF('2.사업팀제공'!$A$6:$A$205>='1.사업팀제공'!B14:B14,'2.사업팀제공'!$A$6:$A$205,\"\"))","v":{"v":1956276,"d":"1,956,276"}}]
[null,null,{"$f":"C14*1.0655","v":{"v":62427.645,"d":"62,428"}},{"$f":"D14*1.0655","v":{"v":50602.725999999995,"d":"50,603"}},{"$f":"E14*1.0655","v":{"v":63264.06249999999,"d":"63,264"}}]
["5인",{"$f":"'3.소득기준금액계산'!H21","v":{"v":2017000,"d":"2,017,000"}},{"$f":"VLOOKUP($G16,'2.사업팀제공'!$A:$D,2,FALSE)","v":{"v":60574,"d":"60,574"}},{"$f":"VLOOKUP($G16,'2.사업팀제공'!$A:$D,3,FALSE)","v":{"v":52181,"d":"52,181"}},{"$f":"VLOOKUP($G16,'2.사업팀제공'!$A:$D,4,FALSE)","v":{"v":61372,"d":"61,372"}},null,{"$f":"MIN(IF('2.사업팀제공'!$A$6:$A$205>='1.사업팀제공'!B16:B16,'2.사업팀제공'!$A$6:$A$205,\"\"))","v":{"v":2022517,"d":"2,022,517"}}]
[null,null,{"$f":"C16*1.0655","v":{"v":64541.596999999994,"d":"64,542"}},{"$f":"D16*1.0655","v":{"v":55598.8555,"d":"55,599"}},{"$f":"E16*1.0655","v":{"v":65391.865999999995,"d":"65,392"}}]
["6인",{"$f":"'3.소득기준금액계산'!I21","v":{"v":2099000,"d":"2,099,000"}},{"$f":"VLOOKUP($G18,'2.사업팀제공'!$A:$D,2,FALSE)","v":{"v":63226,"d":"63,226"}},{"$f":"VLOOKUP($G18,'2.사업팀제공'!$A:$D,3,FALSE)","v":{"v":56203,"d":"56,203"}},{"$f":"VLOOKUP($G18,'2.사업팀제공'!$A:$D,4,FALSE)","v":{"v":64087,"d":"64,087"}},null,{"$f":"MIN(IF('2.사업팀제공'!$A$6:$A$205>='1.사업팀제공'!B18:B18,'2.사업팀제공'!$A$6:$A$205,\"\"))","v":{"v":2111042,"d":"2,111,042"}}]
[null,null,{"$f":"C18*1.0655","v":{"v":67367.303,"d":"67,367"}},{"$f":"D18*1.0655","v":{"v":59884.2965,"d":"59,884"}},{"$f":"E18*1.0655","v":{"v":68284.6985,"d":"68,285"}}]
["7인",{"$f":"'3.소득기준금액계산'!J21","v":{"v":2181000,"d":"2,181,000"}},{"$f":"VLOOKUP($G20,'2.사업팀제공'!$A:$D,2,FALSE)","v":{"v":65650,"d":"65,650"}},{"$f":"VLOOKUP($G20,'2.사업팀제공'!$A:$D,3,FALSE)","v":{"v":59374,"d":"59,374"}},{"$f":"VLOOKUP($G20,'2.사업팀제공'!$A:$D,4,FALSE)","v":{"v":65927,"d":"65,927"}},null,{"$f":"MIN(IF('2.사업팀제공'!$A$6:$A$205>='1.사업팀제공'!B20:B20,'2.사업팀제공'!$A$6:$A$205,\"\"))","v":{"v":2191994,"d":"2,191,994"}}]
{"$rows_left_out":729}
{"sheet":"2.사업팀제공","index":1,"n_rows":205,"n_cols":13,"rows_kept":205,"merged":[[0,0,0,3],[0,4,0,12],[1,0,1,3],[1,7,1,10],[3,0,4,0],[3,1,3,3],[3,5,4,5],[3,7,4,7],[3,8,3,10]]}
["*산정표는 소득액(원)이 높은가격 순으로 정렬할것",{"$nulls":3},"*산정표는 소숫점이 없어야 가능함(제거방법 :  전체 복사 > 메모장에 붙여넣기 > 메모장 전체복사 > 엑셀에 붙여넣기)"]
["건강보험료 산정기준표(2014년)",{"$nulls":6},"건강보험료 산정기준표(2013년) 참고"]
[]
["소득액(원)\n(초과~이하)","건강보험료 본인부담금(원)",{"$nulls":3},"연번",null,"소득액(원)\n(초과~이하)","건강보험료 본인부담금(원)"]
[null,"직장","지역","혼합",{"$nulls":4},"직장","지역","혼합"]
[{"v":30381623,"d":"30,381,623"},{"v":909930,"d":"909,930"},{"v":590327,"d":"590,327"},"-",null,200,null,{"v":30066433.5815655,"d":"30,066,434"},{"v":885456.4689771039,"d":"885,456"},{"v":563405.3853623294,"d":"563,405"},"-"]
[{"v":13765603,"d":"13,765,603"},{"v":412280,"d":"412,280"},{"v":388559,"d":"388,559"},{"v":909930,"d":"909,930"},null,199,null,{"v":13452591.7721547,"d":"13,452,592"},{"v":396178.82768995594,"d":"396,179"},{"v":376995.02210255095,"d":"376,995"},{"v":885456.4689771039,"d":"885,456"}]
[{"v":11252085,"d":"11,252,085"},{"v":337000,"d":"337,000"},{"v":347056,"d":"347,056"},{"v":412280,"d":"412,280"},null,198,null,{"v":11003947.10888,"d":"11,003,947"},{"v":324066.242356516,"d":"324,066"},{"v":337071.6073692871,"d":"337,072"},{"v":396178.82768995594,"d":"396,179"}]
[{"v":10115660,"d":"10,115,660"},{"v":302964,"d":"302,964"},{"v":320869,"d":"320,869"},{"v":337000,"d":"337,000"},null,197,null,{"v":9906906.95953853,"d":"9,906,907"},{"v":291758.4099584097,"d":"291,758"},{"v":311643.5960996334,"d":"311,644"},{"v":324066.242356516,"d":"324,066"}]
[{"v":9446851,"d":"9,446,851"},{"v":282933,"d":"282,933"},{"v":301713,"d":"301,713"},{"v":302964,"d":"302,964"},null,196,null,{"v":9226680.03411152,"d":"9,226,680"},{"v":271725.7270045843,"d":"271,726"},{"v":293097.25260256475,"d":"293,097"},{"v":291758.4099584097,"d":"291,758"}]
[{"v":8926273,"d":"8,926,273"},{"v":267342,"d":"267,342"},{"v":286630,"d":"286,630"},{"v":282933,"d":"282,933"},null,195,null,{"v":8709334.3720459,"d":"8,709,334"},{"v":256489.89725675178,"d":"256,490"},{"v":278502.936668525,"d":"278,503"},{"v":271725.7270045843,"d":"271,726"}]
[{"v":8503424,"d":"8,503,424"},{"v":254678,"d":"254,678"},{"v":274177,"d":"274,177"},{"v":267342,"d":"267,342"},null,194,null,{"v":8299404.02345132,"d":"8,299,404"},{"v":244417.44849064137,"d":"244,417"},{"v":266391.5353529122,"d":"266,392"},{"v":256489.89725675178,"d":"256,490"}]
[{"v":8149781,"d":"8,149,781"},{"v":244086,"d":"244,086"},{"v":263557,"d":"263,557"},{"v":254678,"d":"254,678"},null,193,null,{"v":7957594.09035789,"d":"7,957,594"},{"v":234351.14596103987,"d":"234,351"},{"v":256107.73043150353,"d":"256,108"},{"v":244417.44849064137,"d":"244,417"}]
[{"v":7848702,"d":"7,848,702"},{"v":235069,"d":"235,069"},{"v":254344,"d":"254,344"},{"v":244086,"d":"244,086"},null,192,null,{"v":7654347.82879477,"d":"7,654,348"},{"v":225420.54355800597,"d":"225,421"},{"v":247199.88089327837,"d":"247,200"},{"v":234351.14596103987,"d":"234,351"}]
[{"v":7562017,"d":"7,562,017"},{"v":226482,"d":"226,482"},{"v":246237,"d":"246,237"},{"v":235069,"d":"235,069"},null,191,null,{"v":7380934.21186645,"d":"7,380,934"},{"v":217368.51253946693,"d":"217,369"},{"v":239252.8792500922,"d":"239,253"},{"v":225420.54355800597,"d":"225,421"}]
[{"v":7300417,"d":"7,300,417"},{"v":218647,"d":"218,647"},{"v":238939,"d":"238,939"},{"v":226482,"d":"226,482"},null,190,null,{"v":7128611.02378396,"d":"7,128,611"},{"v":209937.59465043765,"d":"209,938"},{"v":232301.56596404553,"d":"232,302"},{"v":217368.51253946693,"d":"217,369"}]
[{"v":7068805,"d":"7,068,805"},{"v":211711,"d":"211,711"},{"v":232429,"d":"232,429"},{"v":218647,"d":"218,647"},null,189,null,{"v":6909484.34818634,"d":"6,909,484"},{"v":203484.31405408774,"d":"203,484"},{"v":225935.15089620012,"d":"225,935"},{"v":209937.59465043765,"d":"209,938"}]
[{"v":6866661,"d":"6,866,661"},{"v":205656,"d":"205,656"},{"v":226542,"d":"226,542"},{"v":211711,"d":"211,711"},null,188,null,{"v":6703394.90159819,"d":"6,703,395"},{"v":197414.9798520667,"d":"197,415"},{"v":220174.4238037063,"d":"220,174"},{"v":203484.31405408774,"d":"203,484"}]
[{"v":6678504,"d":"6,678,504"},{"v":200021,"d":"200,021"},{"v":221111,"d":"221,111"},{"v":205656,"d":"205,656"},null,187,null,{"v":6517591.41274929,"d":"6,517,591"},{"v":191943.0671054666,"d":"191,943"},{"v":214960.73377837872,"d":"214,961"},{"v":197414.9798520667,"d":"197,415"}]
[{"v":6512422,"d":"6,512,422"},{"v":195047,"d":"195,047"},{"v":216117,"d":"216,117"},{"v":200021,"d":"200,021"},null,186,null,{"v":6351726.07348494,"d":"6,351,726"},{"v":187058.3328641315,"d":"187,058"},{"v":210152.3283655964,"d":"210,152"},{"v":191943.0671054666,"d":"191,943"}]
{"$rows_left_out":186}
{"sheet":"3.소득기준금액계산","index":2,"n_rows":163,"n_cols":13,"rows_kept":163,"merged":[[1,10,1,12],[3,1,3,7],[100,1,100,6]]}
[]
[null,"<전국가구평균소득 : 2012.4/4분기~ 2013.3/4분기 평균금액>",{"$nulls":8},"*빨간박스에 노란색 부분만 입력할것"]
[]
[null,"- 자료 :  통계청 통계포털 (www.kosis.kr에서 [주제별 통계]-물가.가계-가계-가계소득지출-가계동향조사(신분류)\n                                                                               -전국(명목)-\"가구원수별 월평균가계수지(1인이상)\"",{"$nulls":8},"5인 - 4인 =",{"$f":"H13-G13","v":{"v":205537,"d":"205,537"}}]
[]
[null,"전국가구평균소득 \n100%",null,"1인","2인","3인","4인","5인이상","6인","7인","8인","9인","10인"]
[null,null,"2012.4/4분기",{"v":1534420,"d":"1,534,420"},{"v":2817097,"d":"2,817,097"},{"v":4252197,"d":"4,252,197"},{"v":4739574,"d":"4,739,574"},{"v":4961996,"d":"4,961,996"}]
[null,null,"2013.1/4분기",{"v":1557616,"d":"1,557,616"},{"v":2881660,"d":"2,881,660"},{"v":4327821,"d":"4,327,821"},{"v":4965308,"d":"4,965,308"},{"v":5168212,"d":"5,168,212"}]
[null,null,"2013.2/4분기",{"v":1527689,"d":"1,527,689"},{"v":2898073,"d":"2,898,073"},{"v":4164849,"d":"4,164,849"},{"v":4646835,"d":"4,646,835"},{"v":5003502,"d":"5,003,502"}]
[null,null,"2013.3/4분기",{"v":1531417,"d":"1,531,417"},{"v":3050417,"d":"3,050,417"},{"v":4380746,"d":"4,380,746"},{"v":4991335,"d":"4,991,335"},{"v":5031489,"d":"5,031,489"}]
[null,null,"합계",{"$f":"SUM(D7:D10)","v":{"v":6151142,"d":"6,151,142"}},{"$f":"SUM(E7:E10)","v":{"v":11647247,"d":"11,647,247"}},{"$f":"SUM(F7:F10)","v":{"v":17125613,"d":"17,125,613"}},{"$f":"SUM(G7:G10)","v":{"v":19343052,"d":"19,343,052"}},{"$f":"SUM(H7:H10)","v":{"v":20165199,"d":"20,165,199"}}]
[null,null,"평균",{"$f":"D11/4","v":{"v":1537785.5,"d":"1,537,785.50"}},{"$f":"E11/4","v":{"v":2911811.75,"d":"2,911,811.75"}},{"$f":"F11/4","v":{"v":4281403.25,"d":"4,281,403.25"}},{"$f":"G11/4","v":{"v":4835763,"d":"4,835,763.00"}},{"$f":"H11/4","v":{"v":5041299.75,"d":"5,041,299.75"}}]
[null,null,"(소수첫째에서반올림)",{"$f":"ROUND(D12,0)","v":{"v":1537786,"d":"1,537,786"}},{"$f":"ROUND(E12,0)","v":{"v":2911812,"d":"2,911,812"}},{"$f":"ROUND(F12,0)","v":{"v":4281403,"d":"4,281,403"}},{"$f":"ROUND(G12,0)","v":{"v":4835763,"d":"4,835,763"}},{"$f":"ROUND(H12,0)","v":{"v":5041300,"d":"5,041,300"}},{"$f":"H13+L4","v":{"v":5246837,"d":"5,246,837"}},{"$f":"I13+L4","v":{"v":5452374,"d":"5,452,374"}},{"$f":"J13+L4","v":{"v":5657911,"d":"5,657,911"}},{"$f":"K13+L4","v":{"v":5863448,"d":"5,863,448"}},{"$f":"L13+L4","v":{"v":6068985,"d":"6,068,985"}}]
[null,null,"(백의자리에서 반올림)",{"$f":"ROUND(D13,-3)","v":{"v":1538000,"d":"1,538천원"}},{"$f":"ROUND(E13,-3)","v":{"v":2912000,"d":"2,912천원"}},{"$f":"ROUND(F13,-3)","v":{"v":4281000,"d":"4,281천원"}},{"$f":"ROUND(G13,-3)","v":{"v":4836000,"d":"4,836천원"}},{"$f":"ROUND(H13,-3)","v":{"v":5041000,"d":"5,041천원"}}]
[]
[]
[null,"전국가구평균소득 40%",null,"1인","2인","3인","4인","5인이상","6인","7인","8인","9인","10인"]
[null,null,"평균(100%)",{"$f":"D13","v":{"v":1537786,"d":"1,537,786"}},{"v":2911812,"d":"2,911,812"},{"v":4281403,"d":"4,281,403"},{"v":4835763,"d":"4,835,763"},{"v":5041300,"d":"5,041,300"},{"v":5246837,"d":"5,246,837"},{"v":5452374,"d":"5,452,374"},{"v":5657911,"d":"5,657,911"},{"v":5863448,"d":"5,863,448"},{"v":6068985,"d":"6,068,985"}]
[null,null,0.4,{"$f":"D18*$C19","v":{"v":615114.4,"d":"615,114.4"}},{"v":1164724.8,"d":"1,164,724.8"},{"v":1712561.2000000002,"d":"1,712,561.2"},{"v":1934305.2000000002,"d":"1,934,305.2"},{"v":2016520,"d":"2,016,520.0"},{"v":2098734.8000000003,"d":"2,098,734.8"},{"v":2180949.6,"d":"2,180,949.6"},{"v":2263164.4,"d":"2,263,164.4"},{"v":2345379.2,"d":"2,345,379.2"},{"v":2427594,"d":"2,427,594.0"}]
[null,null,"(소수첫째에서 반올림)",{"$f":"ROUND(D19,0)","v":{"v":615114,"d":"615,114"}},{"v":1164725,"d":"1,164,725"},{"v":1712561,"d":"1,712,561"},{"v":1934305,"d":"1,934,305"},{"v":2016520,"d":"2,016,520"},{"v":2098735,"d":"2,098,735"},{"v":2180950,"d":"2,180,950"},{"v":2263164,"d":"2,263,164"},{"v":2345379,"d":"2,345,379"},{"v":2427594,"d":"2,427,594"}]
{"$rows_left_out":144}
{"sheet":"4.건보료자료","index":3,"n_rows":216,"n_cols":20,"rows_kept":216,"merged":[[7,10,7,13],[7,17,7,19],[8,0,9,0],[8,1,8,6],[8,7,8,12],[8,13,9,13]]}
[]
[]
[{"$nulls":16},"2014 보험요율 5.99%"," 2014 증가율 1.7%"]
["<작성기준>",{"$nulls":14},"2013년도","2014년도","2014년도"]
["1. 구성비 : 보험료가 낮은 순서로 정렬, 구간 : 초과~이하 ",{"$nulls":14},"현재 보험요율","보험요율/2(본인부담금)","건강보험료증가율"]
["2. 보험료기준 : 2013년 11월 보험료 기준, 본인부담액 기준",{"$nulls":14},0.02945,0.02995,1.017]
["3. 최고보험료 : 각 구간별로 가장 높은 보험료 금액"]
[{"$nulls":10},"(단위: 가입(세대)수, 원)",{"$nulls":6},"*자동계산(만지지 마세요)"]
["구성비","직장가입자",{"$nulls":5},"지역가입자",{"$nulls":5},"비고",{"$nulls":3},"2014년도 직장","2014년도 지역","2014년도 혼합"]
[null,"가입자수(a)","총보험료(b)","평균소득","평균보험료(b/a)","최고소득","최고보험료","세대수(a)","총보험료(b)","평균점수","평균보험료(b/a)","최고점수","최고 보험료",{"$nulls":4},"평균보험료 산출","평균보험료 산출","보험료 산출"]
["합계"]
["~0.5%",69091,710776140,{"v":341716.083194627,"d":"341,716"},10287.5358585054,403400,11880,37147,74294000,20.3462998357875,2000,312,2000,{"$nulls":4},{"$f":"ROUND(D12*$Q$6,0)","v":{"v":10234,"d":"10,234"}},{"$f":"ROUND(K12*$R$6,0)","v":{"v":2034,"d":"2,034"}},{"$f":"R13","v":{"v":13953,"d":"13,953"}}]
["~1%",69092,947625080,{"v":465880.897846349,"d":"465,881"},13715.4095987958,500000,14720,37148,88547970,21.3802358135027,2383.65376332507,1893,2420,{"$nulls":4},{"v":13953,"d":"13,953"},{"$f":"ROUND(K13*$R$6,0)","v":{"v":2424,"d":"2,424"}},{"$f":"R14","v":{"v":15741,"d":"15,741"}}]
["~1.5%",69091,1070104010,{"v":525592.373116614,"d":"525,592"},15488.32713378,568620,16740,37147,91236940,31.3914448003876,2456.10520365036,3771,2700,{"$nulls":4},{"v":15741,"d":"15,741"},{"v":2498,"d":"2,498"},{"v":17935,"d":"17,935"}]
["~2%",69092,1218333590,{"v":598840.869666531,"d":"598,841"},17633.4972210965,625296,18410,37148,101296860,28.7085980402713,2726.84559061053,2524,2760,{"$nulls":4},{"v":17935,"d":"17,935"},{"v":2773,"d":"2,773"},{"v":19698,"d":"19,698"}]
["~2.5%",69092,1337945580,{"v":657700.509653794,"d":"657,701"},19364.6960574306,1000000,20510,37147,112504230,28.0732226020943,3028.62223059735,1907,3450,{"$nulls":4},{"v":19698,"d":"19,698"},{"v":3080,"d":"3,080"},{"v":20972,"d":"20,972"}]
["~3%",69091,1424619910,{"v":700225.037414424,"d":"700,225"},20619.4715664847,708333,20860,37148,128160600,20,3450,20,3450,{"$nulls":4},{"v":20972,"d":"20,972"},{"v":3509,"d":"3,509"},{"v":22041,"d":"22,041"}]
["~3.5%",69092,1497013390,{"v":735910.318141029,"d":"735,910"},21666.9569559428,758335,22330,37147,128157150,20,3450,20,3450,{"$nulls":4},{"v":22041,"d":"22,041"},{"v":3509,"d":"3,509"},{"v":23463,"d":"23,463"}]
["~4%",69092,1594042790,{"v":783389.493067214,"d":"783,389"},23071.3076767208,800000,23560,37148,135026930,76.3450791428879,3634.83713793474,6924,3870,{"$nulls":4},{"v":23463,"d":"23,463"},{"v":3697,"d":"3,697"},{"v":23960,"d":"23,960"}]
["~4.5%",69091,1627783960,{"v":800000,"d":"800,000"},23560,800000,23560,37147,164228730,49.0763722507874,4421.04961369693,3205,4660,{"$nulls":4},{"v":23960,"d":"23,960"},{"v":4496,"d":"4,496"},{"v":24620,"d":"24,620"}]
{"$rows_left_out":196}